Reaction Details
TargetSodium-dependent dopamine transporter
LigandBDBM50189574
Substrate/Competitorn/a
Meas. Tech.ChEMBL_395402 (CHEMBL908067)
Ki 12.25±n/a nM
Citation Zeng, FJarkas, NOwens, MJKilts, CDNemeroff, CBGoodman, MM Synthesis and monoamine transporter affinity of front bridged tricyclic 3beta-(4'-halo or 4'-methyl)phenyltropanes bearing methylene or carbomethoxymethylene on the bridge to the 2beta-position. Bioorg Med Chem Lett16:4661-3 (2006) 
 
Sodium-dependent dopamine transporter
Name:Sodium-dependent dopamine transporter
Type:Multi-pass membrane protein
Mol. Mass.:68497.11
Organism:Homo sapiens (Human)
Description:Q01959
Residue:620
BDBM50189574
NameBDBM50189574
Synonyms:3-(4-chloro-phenyl)-5-methylene-7-aza-tricyclo[5.3.0.0*4,8*]decane | CHEMBL378536
TypeSmall organic molecule
Emp. Form.C16H18ClN
Mol. Mass.259.774
SMILESClc1ccc(cc1)C1CC2CCC3C1C(=C)CN23