Reaction Details
TargetMelanin-concentrating hormone receptor 1
LigandBDBM50189593
Substrate/Competitorn/a
Meas. Tech.ChEMBL_368881 (CHEMBL865555)
Ki 2±n/a nM
Citation Dyck, BMarkison, SZhao, LTamiya, JGrey, JRowbottom, MWZhang, MVickers, TSorensen, KNorton, CWen, JHeise, CESaunders, JConlon, PMadan, ASchwarz, DGoodfellow, VS A thienopyridazinone-based melanin-concentrating hormone receptor 1 antagonist with potent in vivo anorectic properties. J Med Chem49:3753-6 (2006) 
 
Melanin-concentrating hormone receptor 1
Name:Melanin-concentrating hormone receptor 1
Type:Enzyme Catalytic Domain
Mol. Mass.:39075.64
Organism:RAT
Description:Melanin Concentrating Hormone 1 GPR24 RAT::P97639
Residue:353
BDBM50189593
NameBDBM50189593
Synonyms:(S)-2-(4-fluorophenyl)-6-(6-(3-(methylamino)pyrrolidin-1-yl)pyridin-3-yl)thieno[2,3-d]pyridazin-7(6H)-one | CHEMBL379933
TypeSmall organic molecule
Emp. Form.C22H20FN5OS
Mol. Mass.421.491
SMILESCN[C@H]1CCN(C1)c1ccc(cn1)-n1ncc2cc(sc2c1=O)-c1ccc(F)cc1