Reaction Details
TargetGalanin receptor type 3
LigandBDBM50189601
Substrate/Competitorn/a
Meas. Tech.ChEMBL_368823 (CHEMBL864918)
Ki>10000±n/a nM
Citation Konkel, MJLagu, BBoteju, LWJimenez, HNoble, SWalker, MWChandrasena, GBlackburn, TPNikam, SSWright, JLKornberg, BEGregory, TPugsley, TAAkunne, HZoski, KWise, LD 3-arylimino-2-indolones are potent and selective galanin GAL3 receptor antagonists. J Med Chem49:3757-8 (2006) 
 
Galanin receptor type 3
Name:Galanin receptor type 3
Type:Enzyme Catalytic Domain
Mol. Mass.:39599.97
Organism:Homo sapiens (Human)
Description:Galanin R3 GALR3 HUMAN::O60755
Residue:368
BDBM50189601
NameBDBM50189601
Synonyms:(E)-3-(4-methoxyphenylimino)indolin-2-one CHEMBL378695
TypeSmall organic molecule
Emp. Form.C15H12N2O2
Mol. Mass.252.268
SMILESCOc1ccc(cc1)\N=C1\C(=O)Nc2ccccc12