Reaction Details
TargetVascular endothelial growth factor receptor 2
LigandBDBM50189605
Substrate/Competitorn/a
Meas. Tech.ChEMBL_368576 (CHEMBL866820)
IC50 1900±n/a nM
Citation Borzilleri, RMBhide, RSBarrish, JCD'Arienzo, CJDerbin, GMFargnoli, JHunt, JTJeyaseelan, RKamath, AKukral, DWMarathe, PMortillo, SQian, LTokarski, JSWautlet, BSZheng, XLombardo, LJ Discovery and evaluation of N-cyclopropyl- 2,4-difluoro-5-((2-(pyridin-2-ylamino)thiazol-5- ylmethyl)amino)benzamide (BMS-605541), a selective and orally efficacious inhibitor of vascular endothelial growth factor receptor-2. J Med Chem49:3766-9 (2006) 
 
Vascular endothelial growth factor receptor 2
Name:Vascular endothelial growth factor receptor 2
Type:Receptor Tyrosine Kinase
Mol. Mass.:151510.97
Organism:Homo sapiens (Human)
Description:P35968
Residue:1356
BDBM50189605
NameBDBM50189605
Synonyms:CHEMBL379495 | N-(5-((5-tert-butyloxazol-2-yl)methylthio)thiazol-2-yl)-3,4-dimethoxybenzamide
TypeSmall organic molecule
Emp. Form.C20H23N3O4S2
Mol. Mass.433.544
SMILESCOc1ccc(cc1OC)C(=O)Nc1ncc(SCc2ncc(o2)C(C)(C)C)s1