Reaction Details
TargetVascular endothelial growth factor receptor 2
LigandBDBM50189602
Substrate/Competitorn/a
Meas. Tech.ChEMBL_368576 (CHEMBL866820)
IC50 71±n/a nM
Citation Borzilleri, RMBhide, RSBarrish, JCD'Arienzo, CJDerbin, GMFargnoli, JHunt, JTJeyaseelan, RKamath, AKukral, DWMarathe, PMortillo, SQian, LTokarski, JSWautlet, BSZheng, XLombardo, LJ Discovery and evaluation of N-cyclopropyl- 2,4-difluoro-5-((2-(pyridin-2-ylamino)thiazol-5- ylmethyl)amino)benzamide (BMS-605541), a selective and orally efficacious inhibitor of vascular endothelial growth factor receptor-2. J Med Chem49:3766-9 (2006) 
 
Vascular endothelial growth factor receptor 2
Name:Vascular endothelial growth factor receptor 2
Type:Receptor Tyrosine Kinase
Mol. Mass.:151510.97
Organism:Homo sapiens (Human)
Description:P35968
Residue:1356
BDBM50189602
NameBDBM50189602
Synonyms:2,4-difluoro-N-methyl-5-((2-(pyridin-2-ylamino)thiazol-5-ylmethyl)amino)benzamide | CHEMBL212267
TypeSmall organic molecule
Emp. Form.C17H15F2N5OS
Mol. Mass.375.396
SMILESCNC(=O)c1cc(NCc2cnc(Nc3ccccn3)s2)c(F)cc1F