Reaction Details
TargetVascular endothelial growth factor receptor 2
LigandBDBM50189610
Substrate/Competitorn/a
Meas. Tech.ChEMBL_368576 (CHEMBL866820)
IC50 85±n/a nM
Citation Borzilleri, RMBhide, RSBarrish, JCD'Arienzo, CJDerbin, GMFargnoli, JHunt, JTJeyaseelan, RKamath, AKukral, DWMarathe, PMortillo, SQian, LTokarski, JSWautlet, BSZheng, XLombardo, LJ Discovery and evaluation of N-cyclopropyl- 2,4-difluoro-5-((2-(pyridin-2-ylamino)thiazol-5- ylmethyl)amino)benzamide (BMS-605541), a selective and orally efficacious inhibitor of vascular endothelial growth factor receptor-2. J Med Chem49:3766-9 (2006) 
 
Vascular endothelial growth factor receptor 2
Name:Vascular endothelial growth factor receptor 2
Type:Receptor Tyrosine Kinase
Mol. Mass.:151510.97
Organism:Homo sapiens (Human)
Description:P35968
Residue:1356
BDBM50189610
NameBDBM50189610
Synonyms:4-fluoro-N-(2-morpholinoethyl)-3-((2-(pyridin-2-ylamino)thiazol-5-ylmethyl)amino)benzamide | CHEMBL211060
TypeSmall organic molecule
Emp. Form.C22H25FN6O2S
Mol. Mass.456.536
SMILESFc1ccc(cc1NCc1cnc(Nc2ccccn2)s1)C(=O)NCCN1CCOCC1