Reaction Details
TargetProtein kinase C zeta type
LigandBDBM50189603
Substrate/Competitorn/a
Meas. Tech.ChEMBL_368592 (CHEMBL866176)
IC50>40000±n/a nM
Citation Borzilleri, RMBhide, RSBarrish, JCD'Arienzo, CJDerbin, GMFargnoli, JHunt, JTJeyaseelan, RKamath, AKukral, DWMarathe, PMortillo, SQian, LTokarski, JSWautlet, BSZheng, XLombardo, LJ Discovery and evaluation of N-cyclopropyl- 2,4-difluoro-5-((2-(pyridin-2-ylamino)thiazol-5- ylmethyl)amino)benzamide (BMS-605541), a selective and orally efficacious inhibitor of vascular endothelial growth factor receptor-2. J Med Chem49:3766-9 (2006) 
 
Protein kinase C zeta type
Name:Protein kinase C zeta type
Type:Enzyme
Mol. Mass.:67649.13
Organism:Homo sapiens (Human)
Description:n/a
Residue:592
BDBM50189603
NameBDBM50189603
Synonyms:CHEMBL377734 | N-cyclopropyl-2,4-difluoro-5-((2-(pyridin-2-ylamino)thiazol-5-yl)methylamino)benzamide
TypeSmall organic molecule
Emp. Form.C19H17F2N5OS
Mol. Mass.401.433
SMILESFc1cc(F)c(cc1NCc1cnc(Nc2ccccn2)s1)C(=O)NC1CC1