Reaction Details
TargetVascular endothelial growth factor receptor 2
LigandBDBM50168387
Substrate/Competitorn/a
Meas. Tech.ChEMBL_368576 (CHEMBL866820)
IC50 18±n/a nM
Citation Borzilleri, RMBhide, RSBarrish, JCD'Arienzo, CJDerbin, GMFargnoli, JHunt, JTJeyaseelan, RKamath, AKukral, DWMarathe, PMortillo, SQian, LTokarski, JSWautlet, BSZheng, XLombardo, LJ Discovery and evaluation of N-cyclopropyl- 2,4-difluoro-5-((2-(pyridin-2-ylamino)thiazol-5- ylmethyl)amino)benzamide (BMS-605541), a selective and orally efficacious inhibitor of vascular endothelial growth factor receptor-2. J Med Chem49:3766-9 (2006) 
 
Vascular endothelial growth factor receptor 2
Name:Vascular endothelial growth factor receptor 2
Type:Receptor Tyrosine Kinase
Mol. Mass.:151510.97
Organism:Homo sapiens (Human)
Description:P35968
Residue:1356
BDBM50168387
NameBDBM50168387
Synonyms:2,4-Difluoro-5-[5-isopropyl-6-(5-methyl-[1,3,4]oxadiazol-2-yl)-pyrrolo[2,1-f][1,2,4]triazin-4-ylamino]-N-methoxy-benzamide CHEMBL365318
TypeSmall organic molecule
Emp. Form.C20H19F2N7O3
Mol. Mass.443.4068
SMILESCONC(=O)c1cc(Nc2ncnn3cc(-c4nnc(C)o4)c(C(C)C)c23)c(F)cc1F