Reaction Details
TargetVascular endothelial growth factor receptor 2
LigandBDBM50189608
Substrate/Competitorn/a
Meas. Tech.ChEMBL_368576 (CHEMBL866820)
IC50 74±n/a nM
Citation Borzilleri, RMBhide, RSBarrish, JCD'Arienzo, CJDerbin, GMFargnoli, JHunt, JTJeyaseelan, RKamath, AKukral, DWMarathe, PMortillo, SQian, LTokarski, JSWautlet, BSZheng, XLombardo, LJ Discovery and evaluation of N-cyclopropyl- 2,4-difluoro-5-((2-(pyridin-2-ylamino)thiazol-5- ylmethyl)amino)benzamide (BMS-605541), a selective and orally efficacious inhibitor of vascular endothelial growth factor receptor-2. J Med Chem49:3766-9 (2006) 
 
Vascular endothelial growth factor receptor 2
Name:Vascular endothelial growth factor receptor 2
Type:Receptor Tyrosine Kinase
Mol. Mass.:151510.97
Organism:Homo sapiens (Human)
Description:P35968
Residue:1356
BDBM50189608
NameBDBM50189608
Synonyms:CHEMBL379661 | N-methoxy-3-((2-(pyridin-2-ylamino)thiazol-5-ylthio)methyl)benzamide
TypeSmall organic molecule
Emp. Form.C17H16N4O2S2
Mol. Mass.372.465
SMILESCONC(=O)c1cccc(CSc2cnc(Nc3ccccn3)s2)c1