Reaction Details
TargetPhosphatidylinositol 4,5-bisphosphate 3-kinase catalytic subunit alpha isoform
LigandBDBM50189742
Substrate/Competitorn/a
Meas. Tech.ChEMBL_367673 (CHEMBL871583)
IC50 600±n/a nM
Citation Pomel, VKlicic, JCovini, DChurch, DDShaw, JPRoulin, KBurgat-Charvillon, FValognes, DCamps, MChabert, CGillieron, CFrançon, BPerrin, DLeroy, DGretener, DNichols, AVitte, PACarboni, SRommel, CSchwarz, MKRückle, T Furan-2-ylmethylene thiazolidinediones as novel, potent, and selective inhibitors of phosphoinositide 3-kinase gamma. J Med Chem49:3857-71 (2006) 
 
Phosphatidylinositol 4,5-bisphosphate 3-kinase catalytic subunit alpha isoform
Name:Phosphatidylinositol 4,5-bisphosphate 3-kinase catalytic subunit alpha isoform
Type:Enzyme Subunit
Mol. Mass.:124294.87
Organism:Homo sapiens (Human)
Description:P42336
Residue:1068
BDBM50189742
NameBDBM50189742
Synonyms:5-[5-(2-hydroxy-5-trifluoromethoxyphenyl)furan-2-ylmethylene]thiazolidine-2,4-dione | CHEMBL211768
TypeSmall organic molecule
Emp. Form.C15H8F3NO5S
Mol. Mass.371.288
SMILESOc1ccc(OC(F)(F)F)cc1-c1ccc(\C=C2/SC(=O)NC2=O)o1