Reaction Details
TargetPhosphatidylinositol 4,5-bisphosphate 3-kinase catalytic subunit gamma isoform
LigandBDBM50189753
Substrate/Competitorn/a
Meas. Tech.ChEMBL_367672 (CHEMBL871582)
IC50 43±n/a nM
Citation Pomel, VKlicic, JCovini, DChurch, DDShaw, JPRoulin, KBurgat-Charvillon, FValognes, DCamps, MChabert, CGillieron, CFrançon, BPerrin, DLeroy, DGretener, DNichols, AVitte, PACarboni, SRommel, CSchwarz, MKRückle, T Furan-2-ylmethylene thiazolidinediones as novel, potent, and selective inhibitors of phosphoinositide 3-kinase gamma. J Med Chem49:3857-71 (2006) 
 
Phosphatidylinositol 4,5-bisphosphate 3-kinase catalytic subunit gamma isoform
Name:Phosphatidylinositol 4,5-bisphosphate 3-kinase catalytic subunit gamma isoform
Type:Enzyme Subunit
Mol. Mass.:126470.30
Organism:Homo sapiens (Human)
Description:P48736
Residue:1102
BDBM50189753
NameBDBM50189753
Synonyms:5-[5-(2-hydroxy-5-chlorophenyl)furan-2-ylmethylene]thiazolidine-2,4-dione | CHEMBL212119
TypeSmall organic molecule
Emp. Form.C14H8ClNO4S
Mol. Mass.321.736
SMILESOc1ccc(Cl)cc1-c1ccc(\C=C2/SC(=O)NC2=O)o1