Reaction Details
TargetPhosphatidylinositol 4,5-bisphosphate 3-kinase catalytic subunit alpha isoform
LigandBDBM50189756
Substrate/Competitorn/a
Meas. Tech.ChEMBL_367673 (CHEMBL871583)
IC50 1000±n/a nM
Citation Pomel, VKlicic, JCovini, DChurch, DDShaw, JPRoulin, KBurgat-Charvillon, FValognes, DCamps, MChabert, CGillieron, CFrançon, BPerrin, DLeroy, DGretener, DNichols, AVitte, PACarboni, SRommel, CSchwarz, MKRückle, T Furan-2-ylmethylene thiazolidinediones as novel, potent, and selective inhibitors of phosphoinositide 3-kinase gamma. J Med Chem49:3857-71 (2006) 
 
Phosphatidylinositol 4,5-bisphosphate 3-kinase catalytic subunit alpha isoform
Name:Phosphatidylinositol 4,5-bisphosphate 3-kinase catalytic subunit alpha isoform
Type:Enzyme Subunit
Mol. Mass.:124294.87
Organism:Homo sapiens (Human)
Description:P42336
Residue:1068
BDBM50189756
NameBDBM50189756
Synonyms:5-[5-(2-fluoro-4-hydroxyphenyl)furan-2-ylmethylene]thiazolidine-2,4-dione | CHEMBL211068
TypeSmall organic molecule
Emp. Form.C14H8FNO4S
Mol. Mass.305.281
SMILESOc1ccc(-c2ccc(\C=C3/SC(=O)NC3=O)o2)c(F)c1