Reaction Details
TargetPhosphatidylinositol 4,5-bisphosphate 3-kinase catalytic subunit gamma isoform
LigandBDBM50189752
Substrate/Competitorn/a
Meas. Tech.ChEMBL_367672 (CHEMBL871582)
IC50 29±n/a nM
Citation Pomel, VKlicic, JCovini, DChurch, DDShaw, JPRoulin, KBurgat-Charvillon, FValognes, DCamps, MChabert, CGillieron, CFrançon, BPerrin, DLeroy, DGretener, DNichols, AVitte, PACarboni, SRommel, CSchwarz, MKRückle, T Furan-2-ylmethylene thiazolidinediones as novel, potent, and selective inhibitors of phosphoinositide 3-kinase gamma. J Med Chem49:3857-71 (2006) 
 
Phosphatidylinositol 4,5-bisphosphate 3-kinase catalytic subunit gamma isoform
Name:Phosphatidylinositol 4,5-bisphosphate 3-kinase catalytic subunit gamma isoform
Type:Enzyme Subunit
Mol. Mass.:126470.30
Organism:Homo sapiens (Human)
Description:P48736
Residue:1102
BDBM50189752
NameBDBM50189752
Synonyms:5-[5-(3,5-difluoro-2-hydroxyphenyl)furan-2-ylmethylene]thiazolidine-2,4-dione | CHEMBL209159
TypeSmall organic molecule
Emp. Form.C14H7F2NO3S2
Mol. Mass.339.337
SMILESOc1c(F)cc(F)cc1-c1ccc(\C=C2/SC(=O)NC2=O)s1