Reaction Details
TargetPhosphatidylinositol 4,5-bisphosphate 3-kinase catalytic subunit alpha isoform
LigandBDBM50189766
Substrate/Competitorn/a
Meas. Tech.ChEMBL_367673 (CHEMBL871583)
IC50 600±n/a nM
Citation Pomel, VKlicic, JCovini, DChurch, DDShaw, JPRoulin, KBurgat-Charvillon, FValognes, DCamps, MChabert, CGillieron, CFrançon, BPerrin, DLeroy, DGretener, DNichols, AVitte, PACarboni, SRommel, CSchwarz, MKRückle, T Furan-2-ylmethylene thiazolidinediones as novel, potent, and selective inhibitors of phosphoinositide 3-kinase gamma. J Med Chem49:3857-71 (2006) 
 
Phosphatidylinositol 4,5-bisphosphate 3-kinase catalytic subunit alpha isoform
Name:Phosphatidylinositol 4,5-bisphosphate 3-kinase catalytic subunit alpha isoform
Type:Enzyme Subunit
Mol. Mass.:124294.87
Organism:Homo sapiens (Human)
Description:P42336
Residue:1068
BDBM50189766
NameBDBM50189766
Synonyms:5-((5-(2-hydroxy-5-nitrophenyl)furan-2-yl)methylene)-2-thioxothiazolidin-4-one | CHEMBL437688
TypeSmall organic molecule
Emp. Form.C14H8N2O5S2
Mol. Mass.348.354
SMILESOc1ccc(cc1-c1ccc(\C=C2/SC(=S)NC2=O)o1)[N+]([O-])=O