Reaction Details
TargetPhosphatidylinositol 4,5-bisphosphate 3-kinase catalytic subunit alpha isoform
LigandBDBM50189765
Substrate/Competitorn/a
Meas. Tech.ChEMBL_367673 (CHEMBL871583)
IC50 630±n/a nM
Citation Pomel, VKlicic, JCovini, DChurch, DDShaw, JPRoulin, KBurgat-Charvillon, FValognes, DCamps, MChabert, CGillieron, CFrançon, BPerrin, DLeroy, DGretener, DNichols, AVitte, PACarboni, SRommel, CSchwarz, MKRückle, T Furan-2-ylmethylene thiazolidinediones as novel, potent, and selective inhibitors of phosphoinositide 3-kinase gamma. J Med Chem49:3857-71 (2006) 
 
Phosphatidylinositol 4,5-bisphosphate 3-kinase catalytic subunit alpha isoform
Name:Phosphatidylinositol 4,5-bisphosphate 3-kinase catalytic subunit alpha isoform
Type:Enzyme Subunit
Mol. Mass.:124294.87
Organism:Homo sapiens (Human)
Description:P42336
Residue:1068
BDBM50189765
NameBDBM50189765
Synonyms:5-(5-pyridin-3-ylfuran-2-ylmethylene)thiazolidine-2,4-dione | CHEMBL376984
TypeSmall organic molecule
Emp. Form.C13H8N2O3S
Mol. Mass.272.279
SMILESOC1=NC(=O)C(S1)=Cc1ccc(o1)-c1cccnc1