Reaction Details
TargetAdenosine receptor A1
LigandBDBM10847
Substrate/Competitorn/a
Meas. Tech.ChEMBL_367224 (CHEMBL864123)
Ki 3800±n/a nM
Citation Lenzi, OColotta, VCatarzi, DVarano, FFilacchioni, GMartini, CTrincavelli, LCiampi, OVarani, KMarighetti, FMorizzo, EMoro, S 4-amido-2-aryl-1,2,4-triazolo[4,3-a]quinoxalin-1-ones as new potent and selective human A3 adenosine receptor antagonists. synthesis, pharmacological evaluation, and ligand-receptor modeling studies. J Med Chem49:3916-25 (2006) 
 
Adenosine receptor A1
Name:Adenosine receptor A1
Type:Enzyme Catalytic Domain
Mol. Mass.:36602.99
Organism:BOVINE
Description:ADENOSINE 0 BOVINE::P28190
Residue:326
BDBM10847
NameBDBM10847
Synonyms:1,3-dimethyl-2,3,6,7-tetrahydro-1H-purine-2,6-dione Afonilum Aminophylline Cardophyllin Theophy-lline Theophylline (1,3-dimethylxanthine)
TypeSmall organic molecule
Emp. Form.C7H8N4O2
Mol. Mass.180.164
SMILESCn1c2nc[nH]c2c(=O)n(C)c1=O