Reaction Details
TargetPeroxisome proliferator-activated receptor alpha
LigandBDBM50085041
Substrate/Competitorn/a
Meas. Tech.ChEMBL_393996 (CHEMBL854665)
EC50 977±n/a nM
Citation Basséne, CESuzenet, FHennuyer, NStaels, BCaignard, DHDacquet, CRenard, PGuillaumet, G Studies towards the conception of new selective PPARbeta/delta ligands. Bioorg Med Chem Lett16:4528-32 (2006) 
 
Peroxisome proliferator-activated receptor alpha
Name:Peroxisome proliferator-activated receptor alpha
Type:Enzyme
Mol. Mass.:52222.08
Organism:Homo sapiens (Human)
Description:Q07869
Residue:468
BDBM50085041
NameBDBM50085041
Synonyms:2-(4-(3-(4-acetyl-3-hydroxy-2-propylphenoxy)propoxy)phenoxy)acetic acid L-165041 {4-[3-(4-Acetyl-3-hydroxy-2-propyl-phenoxy)-propoxy]-phenoxy}-acetic acid(L-165041) | {4-[3-(4-acetyl-3-hydroxy-2-propylphenoxy)propoxy]phenoxy}acetic acid
TypeSmall organic molecule
Emp. Form.C22H26O7
Mol. Mass.402.4376
SMILESCCCc1c(O)c(ccc1OCCCOc1ccc(OCC(O)=O)cc1)C(C)=O