Reaction Details
TargetProstaglandin G/H synthase 1
LigandBDBM50189989
Substrate/Competitorn/a
Meas. Tech.ChEMBL_391093 (CHEMBL869872)
IC50 4.1±n/a nM
Citation Navidpour, LAmini, MShafaroodi, HAbdi, KGhahremani, MHDehpour, ARShafiee, A Design and synthesis of new water-soluble tetrazolide derivatives of celecoxib and rofecoxib as selective cyclooxygenase-2 (COX-2) inhibitors. Bioorg Med Chem Lett16:4483-7 (2006) 
 
Prostaglandin G/H synthase 1
Name:Prostaglandin G/H synthase 1
Type:Protein
Mol. Mass.:68868.60
Organism:Ovis aries (Sheep)
Description:n/a
Residue:600
BDBM50189989
NameBDBM50189989
Synonyms:4-(4-methylphenyl)-1-[4-(5-tetrazolyl)phenyl]-3-(trifluoromethyl)-1H-pyrazole | CHEMBL213338
TypeSmall organic molecule
Emp. Form.C18H13F3N6
Mol. Mass.370.3312
SMILESCc1ccc(cc1)-c1cc(nn1-c1ccc(cc1)-c1nnn[nH]1)C(F)(F)F