Reaction Details
TargetD(2) dopamine receptor
LigandBDBM50190040
Substrate/Competitorn/a
Meas. Tech.ChEMBL_393314 (CHEMBL911524)
Ki 197±n/a nM
Citation Su, JTang, HMcKittrick, BABurnett, DAZhang, HSmith-Torhan, AFawzi, ALachowicz, J Modification of the clozapine structure by parallel synthesis. Bioorg Med Chem Lett16:4548-53 (2006) 
 
D(2) dopamine receptor
Name:D(2) dopamine receptor
Type:Cell-surface receptors
Mol. Mass.:50647.10
Organism:Homo sapiens (Human)
Description:P14416
Residue:443
BDBM50190040
NameBDBM50190040
Synonyms:CHEMBL215414 | N-[2-chloro-11-(4-methyl-piperazin-1-yl)-dibenzo[b,e][1,4]diazepin-5-yl]-2,6-dimethoxy-benzamide
TypeSmall organic molecule
Emp. Form.C27H28ClN5O3
Mol. Mass.505.996
SMILESCOc1cccc(OC)c1C(=O)NN1c2ccccc2N=C(N2CCN(C)CC2)c2cc(Cl)ccc12