Reaction Details
TargetD(2) dopamine receptor
LigandBDBM50190045
Substrate/Competitorn/a
Meas. Tech.ChEMBL_393314 (CHEMBL911524)
Ki 29±n/a nM
Citation Su, JTang, HMcKittrick, BABurnett, DAZhang, HSmith-Torhan, AFawzi, ALachowicz, J Modification of the clozapine structure by parallel synthesis. Bioorg Med Chem Lett16:4548-53 (2006) 
 
D(2) dopamine receptor
Name:D(2) dopamine receptor
Type:Cell-surface receptors
Mol. Mass.:50647.10
Organism:Homo sapiens (Human)
Description:P14416
Residue:443
BDBM50190045
NameBDBM50190045
Synonyms:8-chloro-11-[4-(2,3-dihydro-benzo[1,4]dioxin-6-ylmethyl)-piperazin-1-yl]-5H-dibenzo[b,e][1,4]diazepine | CHEMBL213577
TypeSmall organic molecule
Emp. Form.C26H25ClN4O2
Mol. Mass.460.955
SMILESClc1ccc2Nc3ccccc3C(=Nc2c1)N1CCN(Cc2ccc3OCCOc3c2)CC1