Reaction Details
TargetD(1A) dopamine receptor
LigandBDBM50190094
Substrate/Competitorn/a
Meas. Tech.ChEMBL_393313 (CHEMBL911523)
Ki 11±n/a nM
Citation Su, JTang, HMcKittrick, BABurnett, DAZhang, HSmith-Torhan, AFawzi, ALachowicz, J Modification of the clozapine structure by parallel synthesis. Bioorg Med Chem Lett16:4548-53 (2006) 
 
D(1A) dopamine receptor
Name:D(1A) dopamine receptor
Type:Enzyme
Mol. Mass.:49303.43
Organism:Homo sapiens (Human)
Description:P21728
Residue:446
BDBM50190094
NameBDBM50190094
Synonyms:CHEMBL212807 | N-[2,8-dichloro-11-(4-methyl-piperazin-1-yl)-dibenzo[b,e][1,4]diazepin-5-yl]-2,6-dimethoxy-benzamide
TypeSmall organic molecule
Emp. Form.C27H27Cl2N5O3
Mol. Mass.540.441
SMILESCOc1cccc(OC)c1C(=O)NN1c2ccc(Cl)cc2N=C(N2CCN(C)CC2)c2cc(Cl)ccc12