Reaction Details
TargetD(2) dopamine receptor
LigandBDBM50190099
Substrate/Competitorn/a
Meas. Tech.ChEMBL_393314 (CHEMBL911524)
Ki 3.4±n/a nM
Citation Su, JTang, HMcKittrick, BABurnett, DAZhang, HSmith-Torhan, AFawzi, ALachowicz, J Modification of the clozapine structure by parallel synthesis. Bioorg Med Chem Lett16:4548-53 (2006) 
 
D(2) dopamine receptor
Name:D(2) dopamine receptor
Type:Cell-surface receptors
Mol. Mass.:50647.10
Organism:Homo sapiens (Human)
Description:P14416
Residue:443
BDBM50190099
NameBDBM50190099
Synonyms:8-chloro-11-[4-(3-trifluoromethoxy-benzyl)-piperazin-1-yl]-5H-dibenzo[b,e][1,4]diazepine | CHEMBL215669
TypeSmall organic molecule
Emp. Form.C25H22ClF3N4O
Mol. Mass.486.917
SMILESFC(F)(F)Oc1cccc(CN2CCN(CC2)C2=Nc3cc(Cl)ccc3Nc3ccccc23)c1