Reaction Details
TargetD(2) dopamine receptor
LigandBDBM50190203
Substrate/Competitorn/a
Meas. Tech.ChEMBL_391332 (CHEMBL870468)
Ki 496±n/a nM
Citation Sasikumar, TKBurnett, DAZhang, HSmith-Torhan, AFawzi, ALachowicz, JE Hydrazides of clozapine: a new class of D1 dopamine receptor subtype selective antagonists. Bioorg Med Chem Lett16:4543-7 (2006) 
 
D(2) dopamine receptor
Name:D(2) dopamine receptor
Type:Cell-surface receptors
Mol. Mass.:50647.10
Organism:Homo sapiens (Human)
Description:P14416
Residue:443
BDBM50190203
NameBDBM50190203
Synonyms:2-amino-6-chloro-N-[8-chloro-11-(4-methyl-piperazin-1-yl)-dibenzo[b,e][1,4]diazepin-5-yl]-benzamide | CHEMBL378669
TypeSmall organic molecule
Emp. Form.C25H24Cl2N6O
Mol. Mass.495.404
SMILESCN1CCN(CC1)C1=Nc2cc(Cl)ccc2N(NC(=O)c2c(N)cccc2Cl)c2ccccc12