Reaction Details
TargetAlpha-2A adrenergic receptor
LigandBDBM50190059
Substrate/Competitorn/a
Meas. Tech.ChEMBL_391340 (CHEMBL870476)
Ki 169±n/a nM
Citation Sasikumar, TKBurnett, DAZhang, HSmith-Torhan, AFawzi, ALachowicz, JE Hydrazides of clozapine: a new class of D1 dopamine receptor subtype selective antagonists. Bioorg Med Chem Lett16:4543-7 (2006) 
 
Alpha-2A adrenergic receptor
Name:Alpha-2A adrenergic receptor
Type:Enzyme
Mol. Mass.:48979.91
Organism:Homo sapiens (Human)
Description:P08913
Residue:465
BDBM50190059
NameBDBM50190059
Synonyms:CHEMBL425069 | N-[8-chloro-11-(4-methyl-piperazin-1-yl)-dibenzo[b,e][1,4]diazepin-5-yl]-2,6-dimethoxy-benzamide
TypeSmall organic molecule
Emp. Form.C27H28ClN5O3
Mol. Mass.505.996
SMILESCOc1cccc(OC)c1C(=O)NN1c2ccc(Cl)cc2N=C(N2CCN(C)CC2)c2ccccc12