Reaction Details
TargetD(1A) dopamine receptor
LigandBDBM50190219
Substrate/Competitorn/a
Meas. Tech.ChEMBL_391331 (CHEMBL870467)
Ki 10±n/a nM
Citation Sasikumar, TKBurnett, DAZhang, HSmith-Torhan, AFawzi, ALachowicz, JE Hydrazides of clozapine: a new class of D1 dopamine receptor subtype selective antagonists. Bioorg Med Chem Lett16:4543-7 (2006) 
 
D(1A) dopamine receptor
Name:D(1A) dopamine receptor
Type:Enzyme
Mol. Mass.:49303.43
Organism:Homo sapiens (Human)
Description:P21728
Residue:446
BDBM50190219
NameBDBM50190219
Synonyms:CHEMBL213443 | quinoline-2-carboxylic acid [8-chloro-11-(4-methyl-piperazin-1-yl)-dibenzo[b,e][1,4]diazepin-5-yl]-amide
TypeSmall organic molecule
Emp. Form.C28H25ClN6O
Mol. Mass.496.991
SMILESCN1CCN(CC1)C1=Nc2cc(Cl)ccc2N(NC(=O)c2ccc3ccccc3n2)c2ccccc12