Reaction Details
TargetD(1A) dopamine receptor
LigandBDBM50190234
Substrate/Competitorn/a
Meas. Tech.ChEMBL_391331 (CHEMBL870467)
Ki 10±n/a nM
Citation Sasikumar, TKBurnett, DAZhang, HSmith-Torhan, AFawzi, ALachowicz, JE Hydrazides of clozapine: a new class of D1 dopamine receptor subtype selective antagonists. Bioorg Med Chem Lett16:4543-7 (2006) 
 
D(1A) dopamine receptor
Name:D(1A) dopamine receptor
Type:Enzyme
Mol. Mass.:49303.43
Organism:Homo sapiens (Human)
Description:P21728
Residue:446
BDBM50190234
NameBDBM50190234
Synonyms:4-ethoxy-thiophene-2-carboxylic acid [8-chloro-11-(4-methyl-piperazin-1-yl)-dibenzo[b,e][1,4]diazepin-5-yl]-amide | CHEMBL437112
TypeSmall organic molecule
Emp. Form.C25H26ClN5O2S
Mol. Mass.496.024
SMILESCCOc1csc(c1)C(=O)NN1c2ccc(Cl)cc2N=C(N2CCN(C)CC2)c2ccccc12