Reaction Details
TargetCarbonic anhydrase 2
LigandBDBM50190250
Substrate/Competitorn/a
Meas. Tech.ChEMBL_400480 (CHEMBL912680)
Ki 18.5±n/a nM
Citation Slawinski, FSlawinski, JKornicka, ABrzozowski, ZPomarnacka, EInnocenti, ASlawinski, ASlawinski, CT Carbonic anhydrase inhibitors. Inhibition of the cytosolic human isozymes I and II, and the transmembrane, tumor-associated isozymes IX and XII with substituted aromatic sulfonamides activatable in hypoxic tumors. Bioorg Med Chem Lett16:4846-51 (2006) 
 
Carbonic anhydrase 2
Name:Carbonic anhydrase 2
Type:Enzyme
Mol. Mass.:29250.71
Organism:Homo sapiens (Human)
Description:P00918
Residue:260
BDBM50190250
NameBDBM50190250
Synonyms:2-chloro-4-mercapto-5-sulfamoyl-benzoic acid ethyl ester | CHEMBL215990
TypeSmall organic molecule
Emp. Form.C9H10ClNO4S2
Mol. Mass.295.763
SMILESCCOC(=O)c1cc(c(S)cc1Cl)S(N)(=O)=O