Reaction Details
TargetCarbonic anhydrase 1
LigandBDBM50190254
Substrate/Competitorn/a
Meas. Tech.ChEMBL_400479 (CHEMBL912679)
Ki 10900±n/a nM
Citation Slawinski, FSlawinski, JKornicka, ABrzozowski, ZPomarnacka, EInnocenti, ASlawinski, ASlawinski, CT Carbonic anhydrase inhibitors. Inhibition of the cytosolic human isozymes I and II, and the transmembrane, tumor-associated isozymes IX and XII with substituted aromatic sulfonamides activatable in hypoxic tumors. Bioorg Med Chem Lett16:4846-51 (2006) 
 
Carbonic anhydrase 1
Name:Carbonic anhydrase 1
Type:Enzyme
Mol. Mass.:28873.37
Organism:Homo sapiens (Human)
Description:P00915
Residue:261
BDBM50190254
NameBDBM50190254
Synonyms:6-(methylthio)-3,4-dihydro-2H-1,2,4-benzothiadiazine-7-sulfonamide 1,1-dioxide | CHEMBL215917
TypeSmall organic molecule
Emp. Form.C8H11N3O4S3
Mol. Mass.309.386
SMILESCSc1cc2NCNS(=O)(=O)c2cc1S(N)(=O)=O