Reaction Details
TargetCarbonic anhydrase 9
LigandBDBM50190256
Substrate/Competitorn/a
Meas. Tech.ChEMBL_400481 (CHEMBL912681)
Ki>10000±n/a nM
Citation Slawinski, FSlawinski, JKornicka, ABrzozowski, ZPomarnacka, EInnocenti, ASlawinski, ASlawinski, CT Carbonic anhydrase inhibitors. Inhibition of the cytosolic human isozymes I and II, and the transmembrane, tumor-associated isozymes IX and XII with substituted aromatic sulfonamides activatable in hypoxic tumors. Bioorg Med Chem Lett16:4846-51 (2006) 
 
Carbonic anhydrase 9
Name:Carbonic anhydrase 9
Type:Enzyme
Mol. Mass.:49669.03
Organism:Homo sapiens (Human)
Description:Catalytic domain of human cloned isozyme was used in the assay
Residue:459
BDBM50190256
NameBDBM50190256
Synonyms:6-(isobutylthio)-3,4-dihydro-2H-1,2,4-benzothiadiazine-7-sulfonamide 1,1-dioxide | CHEMBL385451
TypeSmall organic molecule
Emp. Form.C11H17N3O4S3
Mol. Mass.351.465
SMILESCC(C)CSc1cc2NCNS(=O)(=O)c2cc1S(N)(=O)=O