Reaction Details
TargetCarbonic anhydrase 1
LigandBDBM50190251
Substrate/Competitorn/a
Meas. Tech.ChEMBL_400479 (CHEMBL912679)
Ki 22100±n/a nM
Citation Slawinski, FSlawinski, JKornicka, ABrzozowski, ZPomarnacka, EInnocenti, ASlawinski, ASlawinski, CT Carbonic anhydrase inhibitors. Inhibition of the cytosolic human isozymes I and II, and the transmembrane, tumor-associated isozymes IX and XII with substituted aromatic sulfonamides activatable in hypoxic tumors. Bioorg Med Chem Lett16:4846-51 (2006) 
 
Carbonic anhydrase 1
Name:Carbonic anhydrase 1
Type:Enzyme
Mol. Mass.:28873.37
Organism:Homo sapiens (Human)
Description:P00915
Residue:261
BDBM50190251
NameBDBM50190251
Synonyms:4-chloro-2-({5-chloro-4-[(pyrrolidin-1-yl)carbonyl]-2-sulfamoylphenyl}disulfanyl)-5-[(pyrrolidin-1-yl)carbonyl]benzene-1-sulfonamide | CHEMBL214993
TypeSmall organic molecule
Emp. Form.C22H24Cl2N4O6S4
Mol. Mass.639.615
SMILESNS(=O)(=O)c1cc(C(=O)N2CCCC2)c(Cl)cc1SSc1cc(Cl)c(cc1S(N)(=O)=O)C(=O)N1CCCC1