Reaction Details
TargetCarbonic anhydrase 9
LigandBDBM50190250
Substrate/Competitorn/a
Meas. Tech.ChEMBL_400481 (CHEMBL912681)
Ki 56±n/a nM
Citation Slawinski, FSlawinski, JKornicka, ABrzozowski, ZPomarnacka, EInnocenti, ASlawinski, ASlawinski, CT Carbonic anhydrase inhibitors. Inhibition of the cytosolic human isozymes I and II, and the transmembrane, tumor-associated isozymes IX and XII with substituted aromatic sulfonamides activatable in hypoxic tumors. Bioorg Med Chem Lett16:4846-51 (2006) 
 
Carbonic anhydrase 9
Name:Carbonic anhydrase 9
Type:Enzyme
Mol. Mass.:49669.03
Organism:Homo sapiens (Human)
Description:Catalytic domain of human cloned isozyme was used in the assay
Residue:459
BDBM50190250
NameBDBM50190250
Synonyms:2-chloro-4-mercapto-5-sulfamoyl-benzoic acid ethyl ester | CHEMBL215990
TypeSmall organic molecule
Emp. Form.C9H10ClNO4S2
Mol. Mass.295.763
SMILESCCOC(=O)c1cc(c(S)cc1Cl)S(N)(=O)=O