Reaction Details
TargetCarbonic anhydrase 9
LigandBDBM50190246
Substrate/Competitorn/a
Meas. Tech.ChEMBL_400481 (CHEMBL912681)
Ki>10000±n/a nM
Citation Slawinski, FSlawinski, JKornicka, ABrzozowski, ZPomarnacka, EInnocenti, ASlawinski, ASlawinski, CT Carbonic anhydrase inhibitors. Inhibition of the cytosolic human isozymes I and II, and the transmembrane, tumor-associated isozymes IX and XII with substituted aromatic sulfonamides activatable in hypoxic tumors. Bioorg Med Chem Lett16:4846-51 (2006) 
 
Carbonic anhydrase 9
Name:Carbonic anhydrase 9
Type:Enzyme
Mol. Mass.:49669.03
Organism:Homo sapiens (Human)
Description:Catalytic domain of human cloned isozyme was used in the assay
Residue:459
BDBM50190246
NameBDBM50190246
Synonyms:CHEMBL384791 | ethyl 2-chloro-4-{[5-chloro-4-(ethoxycarbonyl)-2-sulfamoylphenyl]disulfanyl}-5-sulfamoylbenzoate
TypeSmall organic molecule
Emp. Form.C18H18Cl2N2O8S4
Mol. Mass.589.51
SMILESCCOC(=O)c1cc(c(SSc2cc(Cl)c(cc2S(N)(=O)=O)C(=O)OCC)cc1Cl)S(N)(=O)=O