Reaction Details
TargetCarbonic anhydrase 2
LigandBDBM50190255
Substrate/Competitorn/a
Meas. Tech.ChEMBL_400480 (CHEMBL912680)
Ki>10000±n/a nM
Citation Slawinski, FSlawinski, JKornicka, ABrzozowski, ZPomarnacka, EInnocenti, ASlawinski, ASlawinski, CT Carbonic anhydrase inhibitors. Inhibition of the cytosolic human isozymes I and II, and the transmembrane, tumor-associated isozymes IX and XII with substituted aromatic sulfonamides activatable in hypoxic tumors. Bioorg Med Chem Lett16:4846-51 (2006) 
 
Carbonic anhydrase 2
Name:Carbonic anhydrase 2
Type:Enzyme
Mol. Mass.:29250.71
Organism:Homo sapiens (Human)
Description:P00918
Residue:260
BDBM50190255
NameBDBM50190255
Synonyms:2-(aminosulfonyl)-5-chloro-4-methylphenyl N-(4-nitrophenyl)benzenecarbohydrazonothioate | CHEMBL385195
TypeSmall organic molecule
Emp. Form.C20H17ClN4O4S2
Mol. Mass.476.956
SMILESCc1cc(c(SC(=NNc2ccc(cc2)[N+]([O-])=O)c2ccccc2)cc1Cl)S(N)(=O)=O