Reaction Details
TargetCarbonic anhydrase 9
LigandBDBM50190245
Substrate/Competitorn/a
Meas. Tech.ChEMBL_400481 (CHEMBL912681)
Ki 5440±n/a nM
Citation Slawinski, FSlawinski, JKornicka, ABrzozowski, ZPomarnacka, EInnocenti, ASlawinski, ASlawinski, CT Carbonic anhydrase inhibitors. Inhibition of the cytosolic human isozymes I and II, and the transmembrane, tumor-associated isozymes IX and XII with substituted aromatic sulfonamides activatable in hypoxic tumors. Bioorg Med Chem Lett16:4846-51 (2006) 
 
Carbonic anhydrase 9
Name:Carbonic anhydrase 9
Type:Enzyme
Mol. Mass.:49669.03
Organism:Homo sapiens (Human)
Description:Catalytic domain of human cloned isozyme was used in the assay
Residue:459
BDBM50190245
NameBDBM50190245
Synonyms:(5-chloro-4-methyl-2-sulfamoyl-benzenesulfonyl)-acetic acid | CHEMBL215355
TypeSmall organic molecule
Emp. Form.C9H10ClNO6S2
Mol. Mass.327.762
SMILESCc1cc(c(cc1Cl)S(=O)(=O)CC(O)=O)S(N)(=O)=O