Reaction Details
TargetCarbonic anhydrase 9
LigandBDBM50190249
Substrate/Competitorn/a
Meas. Tech.ChEMBL_400481 (CHEMBL912681)
Ki 1613±n/a nM
Citation Slawinski, FSlawinski, JKornicka, ABrzozowski, ZPomarnacka, EInnocenti, ASlawinski, ASlawinski, CT Carbonic anhydrase inhibitors. Inhibition of the cytosolic human isozymes I and II, and the transmembrane, tumor-associated isozymes IX and XII with substituted aromatic sulfonamides activatable in hypoxic tumors. Bioorg Med Chem Lett16:4846-51 (2006) 
 
Carbonic anhydrase 9
Name:Carbonic anhydrase 9
Type:Enzyme
Mol. Mass.:49669.03
Organism:Homo sapiens (Human)
Description:Catalytic domain of human cloned isozyme was used in the assay
Residue:459
BDBM50190249
NameBDBM50190249
Synonyms:2-(5-chloro-4-methyl-2-sulfamoyl-benzenesulfonyl)-propionic acid methyl ester | CHEMBL380158
TypeSmall organic molecule
Emp. Form.C11H14ClNO6S2
Mol. Mass.355.815
SMILESCOC(=O)C(C)S(=O)(=O)c1cc(Cl)c(C)cc1S(N)(=O)=O