Reaction Details
TargetMalonyl-CoA decarboxylase, mitochondrial
LigandBDBM50190401
Substrate/Competitorn/a
Meas. Tech.ChEMBL_375433 (CHEMBL864146)
IC50 5±n/a nM
Citation Cheng, JFHuang, YPenuliar, RNishimoto, MLiu, LArrhenius, TYang, GO'leary, EBarbosa, MBarr, RDyck, JRLopaschuk, GDNadzan, AM Discovery of potent and orally available malonyl-CoA decarboxylase inhibitors as cardioprotective agents. J Med Chem49:4055-8 (2006) 
 
Malonyl-CoA decarboxylase, mitochondrial
Name:Malonyl-CoA decarboxylase, mitochondrial
Type:PROTEIN
Mol. Mass.:55018.37
Organism:Homo sapiens (Human)
Description:ChEMBL_665404
Residue:493
BDBM50190401
NameBDBM50190401
Synonyms:CHEMBL211177 | tert-butyl-(3S)-3-{[(5R)-5-(2,2,2-trifluoro-1-hydroxy-1-trifluoromethyl-ethyl)-4,5-dihydro-isoxazole-3-carbonyl]-amino}-butanoate
TypeSmall organic molecule
Emp. Form.C15H20F6N2O5
Mol. Mass.422.3201
SMILESC[C@@H](CC(=O)OC(C)(C)C)NC(=O)C1=NO[C@H](C1)C(O)(C(F)(F)F)C(F)(F)F