Reaction Details
TargetAdenosine receptor A3
LigandBDBM50109471
Substrate/Competitorn/a
Meas. Tech.ChEMBL_375257 (CHEMBL867484)
Ki 0.65±n/a nM
Citation Tafi, ABernardini, CBotta, MCorelli, FAndreini, MMartinelli, AOrtore, GBaraldi, PGFruttarolo, FBorea, PATuccinardi, T Pharmacophore based receptor modeling: the case of adenosine A3 receptor antagonists. An approach to the optimization of protein models. J Med Chem49:4085-97 (2006) 
 
Adenosine receptor A3
Name:Adenosine receptor A3
Type:G Protein-Coupled Receptor (GPCR)
Mol. Mass.:36197.32
Organism:Homo sapiens (Human)
Description:P0DMS8
Residue:318
BDBM50109471
NameBDBM50109471
Synonyms:1-(8-Ethyl-2-furan-2-yl-8H-pyrazolo[4,3-e][1,2,4]triazolo[1,5-c]pyrimidin-5-yl)-3-(4-nitro-phenyl)-urea CHEMBL165910
TypeSmall organic molecule
Emp. Form.C19H15N9O4
Mol. Mass.433.3803
SMILESCCn1cc2c(n1)nc(NC(=O)Nc1ccc(cc1)[N+]([O-])=O)n1nc(nc21)-c1ccco1