Reaction Details
TargetDeoxyuridine 5'-triphosphate nucleotidohydrolase
LigandBDBM50190559
Substrate/Competitorn/a
Meas. Tech.ChEMBL_373621 (CHEMBL869761)
Ki 32000±n/a nM
Citation Nguyen, CRuda, GFSchipani, AKasinathan, GLeal, IMusso-Buendia, AKaiser, MBrun, RRuiz-Pérez, LMSahlberg, BLJohansson, NGGonzalez-Pacanowska, DGilbert, IH Acyclic nucleoside analogues as inhibitors of Plasmodium falciparum dUTPase. J Med Chem49:4183-95 (2006) 
 
Deoxyuridine 5'-triphosphate nucleotidohydrolase
Name:Deoxyuridine 5'-triphosphate nucleotidohydrolase
Synonyms:dUTP pyrophosphatase
Type:Protein
Mol. Mass.:19574.43
Organism:Plasmodium falciparum
Description:Q8II92
Residue:173
BDBM50190559
NameBDBM50190559
TypeSmall organic molecule
Emp. Form.C17H20N2O4
Mol. Mass.316.3517
SMILESO=C(OCCCCCCn1ccc(=O)[nH]c1=O)c1ccccc1