Reaction Details
TargetDeoxyuridine 5'-triphosphate nucleotidohydrolase
LigandBDBM50190567
Substrate/Competitorn/a
Meas. Tech.ChEMBL_373621 (CHEMBL869761)
Ki 2200±n/a nM
Citation Nguyen, CRuda, GFSchipani, AKasinathan, GLeal, IMusso-Buendia, AKaiser, MBrun, RRuiz-Pérez, LMSahlberg, BLJohansson, NGGonzalez-Pacanowska, DGilbert, IH Acyclic nucleoside analogues as inhibitors of Plasmodium falciparum dUTPase. J Med Chem49:4183-95 (2006) 
 
Deoxyuridine 5'-triphosphate nucleotidohydrolase
Name:Deoxyuridine 5'-triphosphate nucleotidohydrolase
Synonyms:dUTP pyrophosphatase
Type:Protein
Mol. Mass.:19574.43
Organism:Plasmodium falciparum
Description:Q8II92
Residue:173
BDBM50190567
NameBDBM50190567
TypeSmall organic molecule
Emp. Form.C26H26N2O3Si
Mol. Mass.442.5817
SMILESO=c1ccn(CCCCO[Si](c2ccccc2)(c2ccccc2)c2ccccc2)c(=O)[nH]1