Reaction Details
TargetDeoxyuridine 5'-triphosphate nucleotidohydrolase, mitochondrial
LigandBDBM50190532
Substrate/Competitorn/a
Meas. Tech.ChEMBL_373622 (CHEMBL869762)
Ki 21000±n/a nM
Citation Nguyen, CRuda, GFSchipani, AKasinathan, GLeal, IMusso-Buendia, AKaiser, MBrun, RRuiz-Pérez, LMSahlberg, BLJohansson, NGGonzalez-Pacanowska, DGilbert, IH Acyclic nucleoside analogues as inhibitors of Plasmodium falciparum dUTPase. J Med Chem49:4183-95 (2006) 
 
Deoxyuridine 5'-triphosphate nucleotidohydrolase, mitochondrial
Name:Deoxyuridine 5'-triphosphate nucleotidohydrolase, mitochondrial
Type:Enzyme
Mol. Mass.:26574.03
Organism:Homo sapiens (Human)
Description:P33316
Residue:252
BDBM50190532
NameBDBM50190532
Synonyms:1-[4-hydroxy-2-(trityloxymethyl)butyl]uracil | CHEMBL213863
TypeSmall organic molecule
Emp. Form.C28H28N2O4
Mol. Mass.456.5329
SMILESOCCC(COC(c1ccccc1)(c1ccccc1)c1ccccc1)Cn1ccc(=O)[nH]c1=O