Reaction Details
TargetDeoxyuridine 5'-triphosphate nucleotidohydrolase, mitochondrial
LigandBDBM50190564
Substrate/Competitorn/a
Meas. Tech.ChEMBL_373622 (CHEMBL869762)
Ki 74000±n/a nM
Citation Nguyen, CRuda, GFSchipani, AKasinathan, GLeal, IMusso-Buendia, AKaiser, MBrun, RRuiz-Pérez, LMSahlberg, BLJohansson, NGGonzalez-Pacanowska, DGilbert, IH Acyclic nucleoside analogues as inhibitors of Plasmodium falciparum dUTPase. J Med Chem49:4183-95 (2006) 
 
Deoxyuridine 5'-triphosphate nucleotidohydrolase, mitochondrial
Name:Deoxyuridine 5'-triphosphate nucleotidohydrolase, mitochondrial
Type:Enzyme
Mol. Mass.:26574.03
Organism:Homo sapiens (Human)
Description:P33316
Residue:252
BDBM50190564
NameBDBM50190564
Synonyms:1-[4-acetyloxy-3-(tritylaminomethyl)butyl]uracil | CHEMBL208621
TypeSmall organic molecule
Emp. Form.C30H31N3O4
Mol. Mass.497.5848
SMILESCC(=O)OCC(CCn1ccc(=O)[nH]c1=O)CNC(c1ccccc1)(c1ccccc1)c1ccccc1