Reaction Details
TargetNeprilysin
LigandBDBM50190746
Substrate/Competitorn/a
Meas. Tech.ChEMBL_369159 (CHEMBL862886)
IC50 14.3±n/a nM
Citation Pryde, DCMaw, GNPlanken, SPlatts, MYSanderson, VCorless, MStobie, ABarber, CGRussell, RFoster, LBarker, LWayman, CVan Der Graaf, PStacey, PMorren, DKohl, CBeaumont, KCoggon, STute, M Novel selective inhibitors of neutral endopeptidase for the treatment of female sexual arousal disorder. Synthesis and activity of functionalized glutaramides. J Med Chem49:4409-24 (2006) 
 
Neprilysin
Name:Neprilysin
Type:Protein
Mol. Mass.:85789.59
Organism:Rattus norvegicus (Rat)
Description:P07861
Residue:750
BDBM50190746
NameBDBM50190746
Synonyms:(R)-2-((1-((5-ethyl-1,3,4-thiadiazol-2-yl)carbamoyl)cyclopentyl)methyl)pentanoic acid R-2-[1-(5-ethyl-[1,3,4]thiadiazol-2-ylcarbamoyl)-cyclopentylmethyl]-pentanoic acid
TypeSmall organic molecule
Emp. Form.C16H25N3O3S
Mol. Mass.339.453
SMILESCCC[C@H](CC1(CCCC1)C(=O)Nc1nnc(CC)s1)C(O)=O