Reaction Details
TargetNeuronal acetylcholine receptor subunit alpha-7
LigandBDBM50190791
Substrate/Competitorn/a
Meas. Tech.ChEMBL_368997 (CHEMBL869740)
Ki 6.3±n/a nM
Citation Wishka, DGWalker, DPYates, KMReitz, SCJia, SMyers, JKOlson, KLJacobsen, EJWolfe, MLGroppi, VEHanchar, AJThornburgh, BACortes-Burgos, LAWong, EHStaton, BARaub, TJHigdon, NRWall, TMHurst, RSWalters, RRHoffmann, WEHajos, MFranklin, SCarey, GGold, LHCook, KKSands, SBZhao, SXSoglia, JRKalgutkar, ASArneric, SPRogers, BN Discovery of N-[(3R)-1-azabicyclo[2.2.2]oct-3-yl]furo[2,3-c]pyridine-5-carboxamide, an agonist of the alpha7 nicotinic acetylcholine receptor, for the potential treatment of cognitive deficits in schizophrenia: synthesis and structure--activity relationship. J Med Chem49:4425-36 (2006) 
 
Neuronal acetylcholine receptor subunit alpha-7
Name:Neuronal acetylcholine receptor subunit alpha-7
Type:Enzyme
Mol. Mass.:56502.44
Organism:Rattus norvegicus (Rat)
Description:Q05941
Residue:502
BDBM50190791
NameBDBM50190791
Synonyms:CHEMBL210865 | N-[(3R)-1-azabicyclo[2.2.2]oct-3-yl]thieno[2,3-c]pyridine-5-carboxamide
TypeSmall organic molecule
Emp. Form.C15H17N3OS
Mol. Mass.287.38
SMILESO=C(N[C@H]1CN2CCC1CC2)c1cc2ccsc2cn1