Reaction Details
TargetSubstance-P receptor
LigandBDBM50220136
Substrate/Competitorn/a
Meas. Tech.ChEMBL_405761 (CHEMBL869873)
IC50 0.09±n/a nM
Citation Finke, PEMeurer, LCLevorse, DAMills, SGMaccoss, MSadowski, SCascieri, MATsao, KLChicchi, GGMetzger, JMMacintyre, DE Cyclopentane-based human NK1 antagonists. Part 1: discovery and initial SAR. Bioorg Med Chem Lett16:4497-503 (2006) 
 
Substance-P receptor
Name:Substance-P receptor
Type:G Protein-Coupled Receptor (GPCR)
Mol. Mass.:46254.43
Organism:Homo sapiens (Human)
Description:P25103
Residue:407
BDBM50220136
NameBDBM50220136
Synonyms:3-[2-{1-[3,5-di(trifluoromethyl)phenyl]ethoxy}-3-(4-fluorophenyl)-1,4-oxazinan-4-ylmethyl]-4,5-dihydro-1H-1,2,4-triazol-5-one 5-[(2R,3S)-2-[(R)-1-(3,5-Bis-trifluoromethyl-phenyl)-ethoxy]-3-(4-fluoro-phenyl)-morpholin-4-ylmethyl]-2,4-dihydro-[1,2,4]triazol-3-one APREPITANT Emend MK-869 US10100030, Aprepitant
TypeSmall organic molecule
Emp. Form.C23H21F7N4O3
Mol. Mass.534.4267
SMILESC[C@@H](O[C@H]1OCCN(Cc2n[nH]c(=O)[nH]2)[C@H]1c1ccc(F)cc1)c1cc(cc(c1)C(F)(F)F)C(F)(F)F