Reaction Details
TargetMelanin-concentrating hormone receptor 1
LigandBDBM50190863
Substrate/Competitorn/a
Meas. Tech.ChEMBL_398818 (CHEMBL908038)
Ki 15±n/a nM
Citation Sasikumar, TKQiang, LWu, WLBurnett, DAGreenlee, WJO'Neill, KHawes, BEvan Heek, MGraziano, M Tetrahydroisoquinolines as MCH-R1 antagonists. Bioorg Med Chem Lett16:4917-21 (2006) 
 
Melanin-concentrating hormone receptor 1
Name:Melanin-concentrating hormone receptor 1
Type:G Protein-Coupled Receptor (GPCR)
Mol. Mass.:45976.27
Organism:Homo sapiens (Human)
Description:Membranes from CHO-K1 cells stably expressing human MCH1R were used in assays.
Residue:422
BDBM50190863
NameBDBM50190863
Synonyms:2-[6-(3-cyano-phenyl)-1'-cyclopropylmethyl-3,4-dihydro-spiro[isoquinoline-1,4'-piperidin]-2-yl]-N-(3,5-dichloro-phenyl)-acetamide | CHEMBL215567
TypeSmall organic molecule
Emp. Form.C32H32Cl2N4O
Mol. Mass.559.529
SMILESClc1cc(Cl)cc(NC(=O)CN2CCc3cc(ccc3C22CCN(CC3CC3)CC2)-c2cccc(c2)C#N)c1