Reaction Details
TargetMelanin-concentrating hormone receptor 1
LigandBDBM50190903
Substrate/Competitorn/a
Meas. Tech.ChEMBL_398818 (CHEMBL908038)
Ki 15±n/a nM
Citation Sasikumar, TKQiang, LWu, WLBurnett, DAGreenlee, WJO'Neill, KHawes, BEvan Heek, MGraziano, M Tetrahydroisoquinolines as MCH-R1 antagonists. Bioorg Med Chem Lett16:4917-21 (2006) 
 
Melanin-concentrating hormone receptor 1
Name:Melanin-concentrating hormone receptor 1
Type:G Protein-Coupled Receptor (GPCR)
Mol. Mass.:45976.27
Organism:Homo sapiens (Human)
Description:Membranes from CHO-K1 cells stably expressing human MCH1R were used in assays.
Residue:422
BDBM50190903
NameBDBM50190903
Synonyms:2-(6-(3-cyanophenyl)-1-(1-cyclobutylpiperidin-4-yl)-3,4-dihydroisoquinolin-2(1H)-yl)-N-(3,5-dichlorophenyl)acetamide | CHEMBL211984
TypeSmall organic molecule
Emp. Form.C33H34Cl2N4O
Mol. Mass.573.555
SMILESClc1cc(Cl)cc(NC(=O)CN2CCc3cc(ccc3C2C2CCN(CC2)C2CCC2)-c2cccc(c2)C#N)c1