Reaction Details
TargetProteinase-activated receptor 1
LigandBDBM50173417
Substrate/Competitorn/a
Meas. Tech.ChEMBL_401364 (CHEMBL854222)
IC50 85±n/a nM
Citation Xia, YChackalamannil, SChan, TMCzarniecki, MDoller, DEagen, KGreenlee, WJTsai, HWang, YAhn, HSBoykow, GCMcPhail, AT Himbacine derived thrombin receptor (PAR-1) antagonists: structure-activity relationship of the lactone ring. Bioorg Med Chem Lett16:4969-72 (2006) 
 
Proteinase-activated receptor 1
Name:Proteinase-activated receptor 1
Type:Protein
Mol. Mass.:47450.07
Organism:Homo sapiens (Human)
Description:P25116
Residue:425
BDBM50173417
NameBDBM50173417
Synonyms:(3R,3aS,4S,4aR,8aS,9aR)-4-(2-(6-ethylpyridin-2-yl)vinyl)-3-methyl-decahydronaphtho[2,3-c]furan-1(3H)-one CHEMBL197791
TypeSmall organic molecule
Emp. Form.C22H29NO2
Mol. Mass.339.4712
SMILESCCc1cccc(\C=C\[C@@H]2[C@@H]3[C@@H](C)OC(=O)[C@@H]3C[C@@H]3CCCC[C@@H]23)n1