Reaction Details
TargetMu-type opioid receptor
LigandBDBM50191056
Substrate/Competitorn/a
Meas. Tech.ChEMBL_401405 (CHEMBL870427)
IC50 42±n/a nM
Citation Petrov, RRVardanyan, RSLee, YSMa, SWDavis, PBegay, LJLai, JYPorreca, FHruby, VJ Synthesis and evaluation of 3-aminopropionyl substituted fentanyl analogues for opioid activity. Bioorg Med Chem Lett16:4946-50 (2006) 
 
Mu-type opioid receptor
Name:Mu-type opioid receptor
Type:Enzyme Catalytic Domain
Mol. Mass.:11165.58
Organism:GUINEA PIG
Description:P97266
Residue:98
BDBM50191056
NameBDBM50191056
Synonyms:(S)-2-amino-3-(4-hydroxy-phenyl)-N-((R)-1-{[((S)-1-{2-[(1-phenethyl-piperidin-4-yl)-phenyl-carbamoyl]-ethylcarbamoyl}-2-phenyl-ethylcarbamoyl)-methyl]-carbamoyl}-ethyl)-propionamide | CHEMBL214022
TypeSmall organic molecule
Emp. Form.C45H55N7O6
Mol. Mass.789.9615
SMILESC[C@@H](NC(=O)[C@@H](N)Cc1ccc(O)cc1)C(=O)NCC(=O)N[C@@H](Cc1ccccc1)C(=O)NCCC(=O)N(C1CCN(CCc2ccccc2)CC1)c1ccccc1