Reaction Details
TargetSubstance-P receptor
LigandBDBM50191082
Substrate/Competitorn/a
Meas. Tech.ChEMBL_395310 (CHEMBL870413)
IC50 0.23±n/a nM
Citation Meurer, LCFinke, PEOwens, KATsou, NNBall, RGMills, SGMaccoss, MSadowski, SCascieri, MATsao, KLChicchi, GGEgger, LALuell, SMetzger, JMMacintyre, DERupniak, NMWilliams, ARHargreaves, RJ Cyclopentane-based human NK1 antagonists. Part 2: development of potent, orally active, water-soluble derivatives. Bioorg Med Chem Lett16:4504-11 (2006) 
 
Substance-P receptor
Name:Substance-P receptor
Type:G Protein-Coupled Receptor (GPCR)
Mol. Mass.:46254.43
Organism:Homo sapiens (Human)
Description:P25103
Residue:407
BDBM50191082
NameBDBM50191082
Synonyms:5-((((1R,2S,3S)-3-((R)-1-(3,5-bis(trifluoromethyl)phenyl)ethoxy)-2-(4-fluorophenyl)cyclopentyl)(methyl)amino)methyl)-2H-1,2,4-triazol-3(4H)-one | CHEMBL379137
TypeSmall organic molecule
Emp. Form.C25H25F7N4O2
Mol. Mass.546.4804
SMILESC[C@@H](O[C@H]1CC[C@H]([C@@H]1c1ccc(F)cc1)N(C)Cc1n[nH]c(=O)[nH]1)c1cc(cc(c1)C(F)(F)F)C(F)(F)F