Reaction Details
TargetSubstance-P receptor
LigandBDBM50191106
Substrate/Competitorn/a
Meas. Tech.ChEMBL_395310 (CHEMBL870413)
IC50 0.25±n/a nM
Citation Meurer, LCFinke, PEOwens, KATsou, NNBall, RGMills, SGMaccoss, MSadowski, SCascieri, MATsao, KLChicchi, GGEgger, LALuell, SMetzger, JMMacintyre, DERupniak, NMWilliams, ARHargreaves, RJ Cyclopentane-based human NK1 antagonists. Part 2: development of potent, orally active, water-soluble derivatives. Bioorg Med Chem Lett16:4504-11 (2006) 
 
Substance-P receptor
Name:Substance-P receptor
Type:G Protein-Coupled Receptor (GPCR)
Mol. Mass.:46254.43
Organism:Homo sapiens (Human)
Description:P25103
Residue:407
BDBM50191106
NameBDBM50191106
Synonyms:(R)-5-((((1R,2S,3S)-3-((R)-1-(3,5-bis(trifluoromethyl)phenyl)ethoxy)-2-(4-fluorophenyl)cyclopentyl)(methyl)amino)methyl)pyrrolidin-2-one | CHEMBL215147
TypeSmall organic molecule
Emp. Form.C27H29F7N2O2
Mol. Mass.546.5202
SMILESC[C@@H](O[C@H]1CC[C@H]([C@@H]1c1ccc(F)cc1)N(C)C[C@H]1CCC(=O)N1)c1cc(cc(c1)C(F)(F)F)C(F)(F)F